Crystal Space
Welcome, Guest. Please login or register.
April 23, 2014, 04:59:18 pm

Login with username, password and session length
Search:     Advanced search
8990 Posts in 2037 Topics by 7618 Members
Latest Member: Tymqwaro
* Home Help Search Login Register
+  Crystal Space
|-+  Crystal Space Development
| |-+  Support
| | |-+  19 errors!!
« previous next »
Pages: [1] Print
Author Topic: 19 errors!!  (Read 3115 times)
naaier
Newbie
*
Posts: 9


View Profile
« on: June 01, 2006, 06:16:38 pm »

hello all.
I dlled the sdk, updated via cvs, ran the "wkstypical.sln" in the "C:\CS\mk\msvc71" dir, and got 19 errors!!
here is a copy:



------ Build started: Project: libcrystalspace, Configuration: Release Win32 ------

Compiling...
winprintf.cpp
..\..\include\csgeom\math.h(104) : error C3861: '_finite': identifier not found, even with argument-dependent lookup
..\..\include\csgeom\math.h(118) : error C3861: '_finite': identifier not found, even with argument-dependent lookup
\CS\libs\csutil\win32\winprintf.cpp(63) : error C3861: '_isatty': identifier not found, even with argument-dependent lookup
\CS\libs\csutil\win32\winprintf.cpp(67) : error C3861: '_get_osfhandle': identifier not found, even with argument-dependent lookup
syspath.cpp
\CS\libs\csutil\syspath.cpp(169) : error C3861: '_access': identifier not found, even with argument-dependent lookup
\CS\libs\csutil\syspath.cpp(183) : error C3861: '_access': identifier not found, even with argument-dependent lookup
snprintf.cpp
..\..\include\csgeom\math.h(104) : error C3861: '_finite': identifier not found, even with argument-dependent lookup
..\..\include\csgeom\math.h(118) : error C3861: '_finite': identifier not found, even with argument-dependent lookup
mmapio.cpp
..\..\include\csgeom\math.h(104) : error C3861: '_finite': identifier not found, even with argument-dependent lookup
..\..\include\csgeom\math.h(118) : error C3861: '_finite': identifier not found, even with argument-dependent lookup
memfile.cpp
..\..\include\csgeom\math.h(104) : error C3861: '_finite': identifier not found, even with argument-dependent lookup
..\..\include\csgeom\math.h(118) : error C3861: '_finite': identifier not found, even with argument-dependent lookup
csstring.cpp
..\..\include\csgeom\math.h(104) : error C3861: '_finite': identifier not found, even with argument-dependent lookup
..\..\include\csgeom\math.h(118) : error C3861: '_finite': identifier not found, even with argument-dependent lookup
renderbuffer.cpp
..\..\include\csgeom\math.h(104) : error C3861: '_finite': identifier not found, even with argument-dependent lookup
..\..\include\csgeom\math.h(118) : error C3861: '_finite': identifier not found, even with argument-dependent lookup
polyclip.cpp
..\..\include\csgeom\math.h(104) : error C3861: '_finite': identifier not found, even with argument-dependent lookup
..\..\include\csgeom\math.h(118) : error C3861: '_finite': identifier not found, even with argument-dependent lookup
Generating Code...

Build log was saved at "file://c:\Cs\out\release71\build\libcrystalspace\\BuildLog.htm"
libcrystalspace - 18 error(s), 0 warning(s)


------ Build started: Project: app3ds2lev, Configuration: Release Win32 ------

Linking...
LINK : fatal error LNK1181: cannot open input file '\cs\out\release71\libs\libcrystalspace.lib'

Build log was saved at "file://c:\Cs\out\release71\build\app3ds2lev\\BuildLog.htm"
app3ds2lev - 1 error(s), 0 warning(s)


---------------------- Done ----------------------

    Build: 0 succeeded, 2 failed, 0 skipped


whats happening??
Logged
jorrit
Administrator
Hero Member
*****
Posts: 1704


View Profile
« Reply #1 on: June 01, 2006, 07:37:35 pm »

Which version of CS did you download?

Which compiler are you using?

Greetings,
Logged
naaier
Newbie
*
Posts: 9


View Profile
« Reply #2 on: June 01, 2006, 09:13:43 pm »

hello jorrit,
I dlled the pseudo stable cs, and I'm using vc2003
« Last Edit: June 02, 2006, 12:27:42 am by naaier » Logged
jorrit
Administrator
Hero Member
*****
Posts: 1704


View Profile
« Reply #3 on: June 01, 2006, 09:19:10 pm »

hello jorrit,
I dlled the pseudo stable cs, and I'm using 2005 express

Perhaps it would have been better not to do the cvs update. We are no longer using cvs but svn instead. Perhaps try using the pseudo stable without doing cvs update after it.

Greetings,
Logged
naaier
Newbie
*
Posts: 9


View Profile
« Reply #4 on: June 01, 2006, 09:20:51 pm »

it seems that because I have 2005 express on the same machine, these errors are arising. I uninstalled the 2005 express, and the solution compiled beautifully

---------------------- Done ----------------------

    Build: 197 succeeded, 0 failed, 0 skipped
« Last Edit: June 02, 2006, 12:48:38 am by naaier » Logged
Pages: [1] Print 
« previous next »
Jump to:  

Powered by MySQL Powered by PHP Powered by SMF 1.1.2 | SMF © 2006-2007, Simple Machines LLC Valid XHTML 1.0! Valid CSS!
Page created in 4.132 seconds with 15 queries.