Crystal Space
Welcome, Guest. Please login or register.
September 19, 2014, 10:57:28 pm

Login with username, password and session length
Search:     Advanced search
9018 Posts in 2051 Topics by 8482 Members
Latest Member: Tracybuchanan
* Home Help Search Login Register
+  Crystal Space
|-+  Crystal Space Development
| |-+  Support
| | |-+  CS compiling error
« previous next »
Pages: [1] Print
Author Topic: CS compiling error  (Read 1065 times)
Rexel
Newbie
*
Posts: 1


View Profile Email
« on: September 13, 2010, 04:44:57 pm »

I have big problems during compiling CS so I would be very thankful if someone could help me. I have MSVS 2008 and SP1 on my computer and I have tried to install CS with the help of website http://www.crystalspace3d.org/docs/online/manual/MSVC7.html. I think that I have required includes and librarys added but something still goes wrong...

When I'm trying to compile wkstypical I get the following kind of error log:

------ Build started: Project: libcrystalspace, Configuration: Release Win32 ------
Compiling...
cl : Command line warning D9035 : option 'Wp64' has been deprecated and will be removed in a future release
kdtree.cpp
..\..\libs\csgeom\kdtree.cpp(228) : error C3861: 'exit': identifier not found
csapplicationframework.cpp
..\..\libs\cstool\csapplicationframework.cpp(114) : error C3861: 'exit': identifier not found
Generating Code...
Build log was saved at "file://c:\Program Files\CS\out\release8\build\libcrystalspace\BuildLog.htm"
libcrystalspace - 2 error(s), 1 warning(s)
------ Build started: Project: libcrystalspace_directx, Configuration: Release Win32 ------
Compiling...
cl : Command line warning D9035 : option 'Wp64' has been deprecated and will be removed in a future release
directdetection.cpp
..\..\libs\csplugincommon\directx\directdetection.cpp(74) : error C3861: 'exit': identifier not found
Build log was saved at "file://c:\Program Files\CS\out\release8\build\libcrystalspace_directx\BuildLog.htm"
libcrystalspace_directx - 1 error(s), 1 warning(s)
------ Build started: Project: plgvfs, Configuration: Release Win32 ------
Linking...
LINK : fatal error LNK1181: cannot open input file '..\..\out\release8\libs\libcrystalspace.lib'
Build log was saved at "file://c:\Program Files\CS\out\release8\build\plgvfs\BuildLog.htm"
plgvfs - 1 error(s), 0 warning(s)
------ Build started: Project: plgtrans_std, Configuration: Release Win32 ------
Linking...
LINK : fatal error LNK1181: cannot open input file '..\..\out\release8\libs\libcrystalspace.lib'
Build log was saved at "file://c:\Program Files\CS\out\release8\build\plgtrans_std\BuildLog.htm"
plgtrans_std - 1 error(s), 0 warning(s)
------ Build started: Project: plgtlfunc, Configuration: Release Win32 ------
Linking...
LINK : fatal error LNK1181: cannot open input file '..\..\out\release8\libs\libcrystalspace.lib'
Build log was saved at "file://c:\Program Files\CS\out\release8\build\plgtlfunc\BuildLog.htm"
plgtlfunc - 1 error(s), 0 warning(s)
------ Build started: Project: plgthingldr, Configuration: Release Win32 ------
Linking...
LINK : fatal error LNK1181: cannot open input file '..\..\out\release8\libs\libcrystalspace.lib'
Build log was saved at "file://c:\Program Files\CS\out\release8\build\plgthingldr\BuildLog.htm"
plgthingldr - 1 error(s), 0 warning(s)
------ Build started: Project: plgthing, Configuration: Release Win32 ------
Linking...
LINK : fatal error LNK1181: cannot open input file '..\..\out\release8\libs\libcrystalspace.lib'
Build log was saved at "file://c:\Program Files\CS\out\release8\build\plgthing\BuildLog.htm"
plgthing - 1 error(s), 0 warning(s)
------ Build started: Project: plgterrainldr, Configuration: Release Win32 ------
Linking...
LINK : fatal error LNK1181: cannot open input file '..\..\out\release8\libs\libcrystalspace.lib'
Build log was saved at "file://c:\Program Files\CS\out\release8\build\plgterrainldr\BuildLog.htm"
plgterrainldr - 1 error(s), 0 warning(s)
------ Build started: Project: plgterrain2ldr, Configuration: Release Win32 ------
Linking...
LINK : fatal error LNK1181: cannot open input file '..\..\out\release8\libs\libcrystalspace.lib'
Build log was saved at "file://c:\Program Files\CS\out\release8\build\plgterrain2ldr\BuildLog.htm"
plgterrain2ldr - 1 error(s), 0 warning(s)
------ Build started: Project: plgterrain2, Configuration: Release Win32 ------
Linking...
LINK : fatal error LNK1181: cannot open input file '..\..\out\release8\libs\libcrystalspace.lib'
Build log was saved at "file://c:\Program Files\CS\out\release8\build\plgterrain2\BuildLog.htm"
plgterrain2 - 1 error(s), 0 warning(s)
------ Build started: Project: plgstdrep, Configuration: Release Win32 ------

Linking...
LINK : fatal error LNK1181: cannot open input file '..\..\out\release8\libs\libcrystalspace.lib'
Build log was saved at "file://c:\Program Files\CS\out\release8\build\plgparticles\BuildLog.htm"
plgparticles - 1 error(s), 0 warning(s)
------ Build started: Project: plgpagingformerldr, Configuration: Release Win32 ------
Linking...
LINK : fatal error LNK1181: cannot open input file '..\..\out\release8\libs\libcrystalspace.lib'
Build log was saved at "file://c:\Program Files\CS\out\release8\build\plgpagingformerldr\BuildLog.htm"
plgpagingformerldr - 1 error(s), 0 warning(s)
------ Build started: Project: plgpagingformer, Configuration: Release Win32 ------
Compiling...
cl : Command line warning D9035 : option 'Wp64' has been deprecated and will be removed in a future release
pagingformer.cpp
..\..\plugins\terraformer\pagingformer\pagingformer.cpp(206) : error C3861: 'exit': identifier not found
..\..\plugins\terraformer\pagingformer\pagingformer.cpp(241) : error C3861: 'exit': identifier not found
Build log was saved at "file://c:\Program Files\CS\out\release8\build\plgpagingformer\BuildLog.htm"
plgpagingformer - 2 error(s), 1 warning(s)
------ Build started: Project: plgodedynam, Configuration: Release Win32 ------
Linking...
LINK : fatal error LNK1181: cannot open input file '..\..\out\release8\libs\libcrystalspace.lib'
Build log was saved at "file://c:\Program Files\CS\out\release8\build\plgodedynam\BuildLog.htm"
plgodedynam - 1 error(s), 0 warning(s)
------ Build started: Project: plgnullmeshldr, Configuration: Release Win32 ------
Linking...
LINK : fatal error LNK1181: cannot open input file '..\..\out\release8\libs\libcrystalspace.lib'
Build log was saved at "file://c:\Program Files\CS\out\release8\build\plgnullmeshldr\BuildLog.htm"
plgnullmeshldr - 1 error(s), 0 warning(s)
------ Build started: Project: plgnullmesh, Configuration: Release Win32 ------
Linking...
LINK : fatal error LNK1181: cannot open input file '..\..\out\release8\libs\libcrystalspace.lib'
Build log was saved at "file://c:\Program Files\CS\out\release8\build\plgnullmesh\BuildLog.htm"
plgnullmesh - 1 error(s), 0 warning(s)
------ Build started: Project: plgnull3d, Configuration: Release Win32 ------
Linking...
LINK : fatal error LNK1181: cannot open input file '..\..\out\release8\libs\libcrystalspace.lib'
Build log was saved at "file://c:\Program Files\CS\out\release8\build\plgnull3d\BuildLog.htm"
plgnull3d - 1 error(s), 0 warning(s)
------ Build started: Project: plgnull2d, Configuration: Release Win32 ------
Linking...
LINK : fatal error LNK1181: cannot open input file '..\..\out\release8\libs\libcrystalspace.lib'
Build log was saved at "file://c:\Program Files\CS\out\release8\build\plgnull2d\BuildLog.htm"
plgnull2d - 1 error(s), 0 warning(s)
------ Build started: Project: plgmovierecorder, Configuration: Release Win32 ------
Compiling...
cl : Command line warning D9035 : option 'Wp64' has been deprecated and will be removed in a future release
rtjpeg.cpp
..\..\plugins\utilities\movierecorder\rtjpeg.cpp(3164) : error C3861: 'exit': identifier not found
Build log was saved at "file://c:\Program Files\CS\out\release8\build\plgmovierecorder\BuildLog.htm"
plgmovierecorder - 1 error(s), 1 warning(s)
------ Build started: Project: plgvproc_std, Configuration: Release Win32 ------
Linking...
LINK : fatal error LNK1181: cannot open input file '..\..\out\release8\libs\libcrystalspace.lib'
Build log was saved at "file://c:\Program Files\CS\out\release8\build\plgvproc_std\BuildLog.htm"
plgvproc_std - 1 error(s), 0 warning(s)
------ Build started: Project: plglghtngldr, Configuration: Release Win32 ------
Linking...
LINK : fatal error LNK1181: cannot open input file '..\..\out\release8\libs\libcrystalspace.lib'
Build log was saved at "file://c:\Program Files\CS\out\release8\build\plglghtngldr\BuildLog.htm"
plglghtngldr - 1 error(s), 0 warning(s)
------ Build started: Project: plglghtng, Configuration: Release Win32 ------
Linking...
LINK : fatal error LNK1181: cannot open input file '..\..\out\release8\libs\libcrystalspace.lib'
Build log was saved at "file://c:\Program Files\CS\out\release8\build\plglghtng\BuildLog.htm"
plglghtng - 1 error(s), 0 warning(s)
------ Build started: Project: plgjoywin, Configuration: Release Win32 ------
Linking...
LINK : fatal error LNK1181: cannot open input file '..\..\out\release8\libs\libcrystalspace_directx.lib'
Build log was saved at "file://c:\Program Files\CS\out\release8\build\plgjoywin\BuildLog.htm"
plgjoywin - 1 error(s), 0 warning(s)
------ Build started: Project: plginstmeshldr, Configuration: Release Win32 ------
Linking...
LINK : fatal error LNK1181: cannot open input file '..\..\out\release8\libs\libcrystalspace.lib'
Build log was saved at "file://c:\Program Files\CS\out\release8\build\plginstmeshldr\BuildLog.htm"
plginstmeshldr - 1 error(s), 0 warning(s)
------ Build started: Project: plginstmesh, Configuration: Release Win32 ------
Linking...
LINK : fatal error LNK1181: cannot open input file '..\..\out\release8\libs\libcrystalspace.lib'
Build log was saved at "file://c:\Program Files\CS\out\release8\build\plginstmesh\BuildLog.htm"
plginstmesh - 1 error(s), 0 warning(s)
------ Build started: Project: plgimgplex, Configuration: Release Win32 ------

(
...
)

------ Build started: Project: app3ds2lev, Configuration: Release Win32 ------
Compiling...
cl : Command line warning D9035 : option 'Wp64' has been deprecated and will be removed in a future release
3ds2lev.cpp
..\..\apps\import\3ds2lev\3ds2lev.cpp(361) : error C3861: 'exit': identifier not found
..\..\apps\import\3ds2lev\3ds2lev.cpp(381) : error C3861: 'exit': identifier not found
Build log was saved at "file://c:\Program Files\CS\out\release8\build\app3ds2lev\BuildLog.htm"
app3ds2lev - 2 error(s), 1 warning(s)
========== Build: 0 succeeded, 158 failed, 20 up-to-date, 0 skipped ==========


 
Logged
res
Develazyoper
CS Developer
Full Member
*****
Posts: 206


View Profile Email
« Reply #1 on: September 13, 2010, 06:18:35 pm »

If you're using MSVS 2008, you need to open the solution from the msvc9 directory.
(“2008” is a marketing number. The real version number is 9.)
Logged
Pages: [1] Print 
« previous next »
Jump to:  

Powered by MySQL Powered by PHP Powered by SMF 1.1.2 | SMF © 2006-2007, Simple Machines LLC Valid XHTML 1.0! Valid CSS!
Page created in 6.185 seconds with 16 queries.