Crystal Space
Welcome, Guest. Please login or register.
October 01, 2014, 05:45:02 pm

Login with username, password and session length
Search:     Advanced search
9020 Posts in 2053 Topics by 8569 Members
Latest Member: Embingos
* Home Help Search Login Register
+  Crystal Space
|-+  Crystal Space Development
| |-+  General Crystal Space Discussion
| | |-+  ARGH!!!!!!! thats it
« previous next »
Pages: [1] Print
Author Topic: ARGH!!!!!!! thats it  (Read 5285 times)
darkzob(unactivated)
Guest


Email
« on: July 30, 2005, 12:28:57 am »

can som1 pload a already compiled version of cs plzzzzz ill do anything for it  ive been trying 2 whole dayss to compile one thign keep getting error zlib not found and when i try to make -k all it say target no specified otr soemthing like dat im getitng relaly annoyed can som1 upoload a compiled version or  tell me a step by step  from   donwloading  cs
Logged
darkzob(unactivated)
Guest


Email
« Reply #1 on: July 30, 2005, 12:53:31 am »

DONT READ ABOVE POST READ BELOW

soz i was annoyed and im getting progress i redone the  manual and now got passed were i was jsut this error now
[quote
]configure: creating ./config.status
./config.status: Files/CrystalSpaceLibs/tools/jam: No such file or directory
config.status: creating Jamfile
config.status: executing include/volatile.h commands
config.status: include/volatile.h is unchanged
config.status: executing Jamconfig commands
config.status: executing Makefile commands
config.status: WARNING: failed to create makefile emulation layer
Quote
Logged
darkzob(unactivated)
Guest


Email
« Reply #2 on: July 30, 2005, 12:55:01 am »

Quote
configure: creating ./config.status
./config.status: Files/CrystalSpaceLibs/tools/jam: No such file or directory
config.status: creating Jamfile
config.status: executing include/volatile.h commands
config.status: include/volatile.h is unchanged
config.status: executing Jamconfig commands
config.status: executing Makefile commands
config.status: WARNING: failed to create makefile emulation layer

i am really really sorry for triple posting but i cant edit posts since im not registered cause i aint reciving my activation link been waiting 2 days
Logged
jorrit
Administrator
Hero Member
*****
Posts: 1706


View Profile
« Reply #3 on: July 30, 2005, 06:00:43 am »

DONT READ ABOVE POST READ BELOW

soz i was annoyed and im getting progress i redone the  manual and now got passed were i was jsut this error now
[quote
]configure: creating ./config.status
./config.status: Files/CrystalSpaceLibs/tools/jam: No such file or directory
config.status: creating Jamfile
config.status: executing include/volatile.h commands
config.status: include/volatile.h is unchanged
config.status: executing Jamconfig commands
config.status: executing Makefile commands
config.status: WARNING: failed to create makefile emulation layer
Quote

Can you tell me exactly what version of CS you are using and what environment you are using (mingw/msys?). Also what version of the cs-winlibs package did you install?

Greetings,
Logged
darkzob(unactivated)
Guest


Email
« Reply #4 on: July 30, 2005, 10:32:46 am »

im using cs 0.98
i use ming w
Logged
jorrit
Administrator
Hero Member
*****
Posts: 1706


View Profile
« Reply #5 on: July 30, 2005, 07:20:56 pm »

im using cs 0.98
i use ming w

And what cs-winlibs package are you using? I also assume you are running this from within msys?

Greetings,
Logged
darkzob
Newbie
*
Posts: 3


View Profile
« Reply #6 on: July 31, 2005, 11:09:38 pm »

yay i have nearly finsihed compiling
when i do make -k all after about 10 min of words it says
make: *** [all] Error 1
« Last Edit: July 31, 2005, 11:42:56 pm by darkzob » Logged
jorrit
Administrator
Hero Member
*****
Posts: 1706


View Profile
« Reply #7 on: August 01, 2005, 05:24:01 am »

yay i have nearly finsihed compiling
when i do make -k all after about 10 min of words it says
make: *** [all] Error 1

In that case do just 'make all' (without the -k) and see what the error is.

Greetings,
Logged
darkzob
Newbie
*
Posts: 3


View Profile
« Reply #8 on: August 01, 2005, 02:22:56 pm »

now  this the error

C:\Program Files\msys\mingw\bin\windres.exe: installation problem, cannot exec `%s' C:\Program: Invalid argument
...skipped soft3d.dll for lack of <plugins!video!renderer!software!>soft3d_resource.o...
make: *** [all] Error 1
Logged
jorrit
Administrator
Hero Member
*****
Posts: 1706


View Profile
« Reply #9 on: August 01, 2005, 02:28:26 pm »

now  this the error

C:\Program Files\msys\mingw\bin\windres.exe: installation problem, cannot exec `%s' C:\Program: Invalid argument
...skipped soft3d.dll for lack of <plugins!video!renderer!software!>soft3d_resource.o...
make: *** [all] Error 1

Look at the FIRST error you get. It is always the first error that is important. You're showing me the last. Better still: give me the entire output you get.

Greetings,
Logged
XhyldazhK
Guest


Email
« Reply #10 on: August 01, 2005, 04:45:19 pm »

Your MSYS is in a path that contains spaces. That doesn't work very well, as far as I know, on Win32. That's the reason the default MSYS installer put MSYS on c:\msys\1.0\ .
Logged
morgul
Newbie
*
Posts: 20


View Profile Email
« Reply #11 on: August 08, 2005, 08:02:06 pm »

Also, I noticed that you didn't respond when Jorrit asked what version of CS win libs you're using... you do have them installed, right?

--Chris
Logged
Tony
Guest


Email
« Reply #12 on: August 10, 2005, 08:34:17 am »

Installing win32-lib isn't the only solution, it also matters WHEN you install win32-lib, which should be AFTER you install Wingw and Msys. That way the win32-lib can update the profile file that is in the Msys or Wingw directory.

As far as I recall, you suppose to run ./configure then JAM instead of make -k all.

Also it's very importent that you uncheck the additional option that win32-lib install, look at the instructions for details.
Logged
Pages: [1] Print 
« previous next »
Jump to:  

Powered by MySQL Powered by PHP Powered by SMF 1.1.2 | SMF © 2006-2007, Simple Machines LLC Valid XHTML 1.0! Valid CSS!
Page created in 5.208 seconds with 16 queries.